document type code
type: ObjectProperty
comment: the code that distinguishes one exchanged document from another (principle 9).
definition: The type of trade document, as a code (UNTDED 1001).
domain includes: TradeDocument
range includes: document-type
term status: proposed