emergency contact
type: ObjectProperty
comment: added from BSP (per-class property assessment)
definition: The person or department to be contacted in the event of any emergency related to these transported dangerous goods.
domain includes: DangerousGoods
range includes: Party
term status: proposed