event classifier
type: DatatypeProperty
comment: code → event-classifier scheme (Phase 3).
domain includes: LifecycleEvent
range includes: string
definition: Whether the event is PLANNED, ESTIMATED or ACTUAL.
term status: proposed