evidence
type: ObjectProperty
definition: A link to auditable evidence supporting an attestation, assessment or claim.
domain includes: Claim
domain includes: ConformityAssessment
domain includes: ConformityAttestation
range includes: Link
term status: proposed