exemption authorization id
type: ObjectProperty
comment: added from BSP (per-class property assessment)
definition: The unique identifier of the exemption authorization for this trade tax.
domain includes: TradeTax
range includes: Identifier
term status: proposed