exemption indicator
type: DatatypeProperty
comment: added from BSP (per-class property assessment)
domain includes: TradeTax
range includes: string
definition: The indication of whether or not there is an exemption from this trade tax.
term status: proposed