final destination location
type: ObjectProperty
comment: brought back from BSP (UNVTD grounding gap)
domain includes: Consignment
range includes: Location
definition: The final destination location for this supply chain consignment.
term status: proposed