finance type
type: DatatypeProperty
comment: code → finance-type scheme (Phase 3).
domain includes: FinanceAgreement
range includes: string
definition: The type of trade finance (letter of credit, factoring, guarantee, …).
term status: proposed