free form
type: DatatypeProperty
comment: restored from BSP (default-keep re-triage)
domain includes: Address
range includes: string
definition: A free form representation, expressed as text, of this trade address.
term status: proposed