frequency effective period
type: ObjectProperty
comment: added from BSP (per-class property assessment)
domain includes: TransportRoute
range includes: Period
definition: A specified period of time for which a frequency is effective for this transport route.
term status: proposed