global id
type: ObjectProperty
comment: added from BSP (per-class property assessment)
definition: A global identifier for this supply chain consignment item.
domain includes: ProductBatch
range includes: Identifier
term status: proposed