guarantee
type: DatatypeProperty
comment: restored from BSP (default-keep re-triage)
definition: The undertaking, expressed as text, given in cash, bond or as a written guarantee to ensure that an obligation will be fulfilled for this cross-border regulatory procedure.
domain includes: RegulatoryProcedure
range includes: string
term status: proposed