has attestation
type: ObjectProperty
definition: A conformity attestation held by the party (replaces BSP's many applicable*Certificate properties).
domain includes: Party
range includes: ConformityAttestation
term status: proposed