hazard class version id
type: ObjectProperty
comment: added from BSP (per-class property assessment)
domain includes: DangerousGoods
range includes: any-code
definition: The unique identifier of the version of a hazard class for these transported dangerous goods.
term status: proposed