ID granularity
type: ObjectProperty
comment: code → product-ID-granularity scheme.
domain includes: Product
range includes: product-idgranularity
definition: The identification granularity of the product (class, batch, item).
term status: proposed