included material
type: ObjectProperty
comment: added from BSP (per-class property assessment)
definition: Material included in this supply chain inventory.
domain includes: SupplyChainInventory
range includes: Material
term status: proposed