included trade product
type: ObjectProperty
comment: added from BSP (per-class property assessment)
definition: A product included in this supply chain inventory.
domain includes: SupplyChainInventory
range includes: Product
term status: proposed