Incoterms code
type: ObjectProperty
comment: code → Incoterms scheme.
domain includes: DeliveryTerms
range includes: delivery-terms-code-list
definition: The Incoterms code of these delivery terms.
term status: proposed