information type code
type: ObjectProperty
comment: added from BSP (per-class property assessment)
domain includes: ServiceCharge
range includes: any-code
definition: A code specifying an information type of this logistics service charge.
term status: proposed