instructed amount
type: ObjectProperty
comment: added from BSP (per-class property assessment)
definition: A monetary value that has been instructed to be transferred between debtor and creditor for these trade payment terms before deduction of charges.
domain includes: PaymentTerms
range includes: MonetaryAmount
term status: proposed