insurance premium amount
type: ObjectProperty
comment: brought back from BSP (UNVTD grounding gap)
definition: The monetary value of the insurance premium for this supply chain consignment.
domain includes: Consignment
range includes: MonetaryAmount
term status: proposed