insurance value amount
type: ObjectProperty
comment: brought back from BSP (UNVTD grounding gap)
domain includes: Consignment
range includes: MonetaryAmount
definition: The monetary value of this supply chain consignment as covered by an insurance policy.
term status: proposed