itinerary route
type: ObjectProperty
comment: restored from BSP (default-keep re-triage)
definition: A route in the itinerary of this logistics transport movement.
domain includes: TransportMovement
range includes: TransportRoute
term status: proposed