jurisdiction
type: DatatypeProperty
comment: code → country/jurisdiction scheme (Phase 3).
definition: The jurisdiction (country/authority) under which a regulation applies.
domain includes: Regulation
range includes: string
term status: proposed