last registered year date time
type: DatatypeProperty
comment: added from BSP (per-class property assessment)
definition: The last registered year of this government registration.
domain includes: GovernmentRegistration
range includes: dateTime
term status: proposed