latest synchronization date time
type: DatatypeProperty
comment: added from BSP (per-class property assessment)
domain includes: SupplyPlan
range includes: dateTime
definition: A date, time, date time, or other date time value of the latest synchronization of the supply chain supply plan.
term status: proposed