Copyleft
type: Concept
definition: Platforms, infrastructure. Restrictiveness - Medium–high
in scheme: License Type
notation: copyleft

Creative Commons
type: Concept
definition: Media, publications. Restrictiveness - Variable
in scheme: License Type
notation: creative-Commons

Permissive Open Source
type: Concept
definition: Libraries, frameworks. Restrictiveness - Low
in scheme: License Type
notation: permissive-OpenSource

Proprietary Code
type: Concept
definition: Commercial software, internal docs. Restrictiveness - Very high
in scheme: License Type
notation: proprietary-Code

Proprietary Document
type: Concept
definition: Manuals, standards. Restrictiveness - Medium
in scheme: License Type
notation: proprietary-Document

Public
type: Concept
definition: Data, examples. Restrictiveness - None
in scheme: License Type
notation: public

Source Available
type: Concept
definition: Commercial SaaS vendors. Restrictiveness - Medium–high
in scheme: License Type
notation: source-Available

License Type
type: ConceptScheme
source: LicenseType
definition: License Type UN/CEFACT code list.
code list scope: domain
term status: proposed