line one
type: DatatypeProperty
comment: restored from BSP (default-keep re-triage)
domain includes: Address
range includes: string
definition: The first free form line, expressed as text, of this financial institution address.
term status: proposed