loaded consignment item
type: ObjectProperty
comment: restored from BSP (default-keep re-triage)
domain includes: TransportEquipment
range includes: ConsignmentItem
definition: A consignment item loaded onto, or into, this piece of logistics transport equipment.
term status: proposed