location function type code
type: ObjectProperty
comment: code → location-function scheme.
definition: The functional type of a location (port, warehouse, terminal, …).
domain includes: Location
range includes: location-function-code-list
term status: proposed