manufacturer assigned id
type: ObjectProperty
comment: added from BSP (per-class property assessment)
domain includes: ProductBatch
range includes: Identifier
definition: A manufacturer assigned identifier of this product batch.
term status: proposed