manufacturer party
type: ObjectProperty
comment: added from BSP (per-class property assessment)
definition: A manufacturer party for this production process.
domain includes: IOTDevice
range includes: Party
term status: proposed