member of
type: ObjectProperty
comment: reshaped from BSP specifiedLegalOrganization.
definition: An organisation this party belongs to (e.g. the legally constituted organisation behind a trading party, or a department's parent).
domain includes: Party
range includes: Organisation
term status: proposed