model id
type: ObjectProperty
comment: added from BSP (per-class property assessment)
definition: A model identifier for this monitoring IOT device.
domain includes: IOTDevice
range includes: Identifier
term status: proposed