modified product
type: ObjectProperty
domain includes: ModifyEvent
range includes: EventProduct
definition: A product modified by the modify event, with its quantity/disposition.
term status: proposed