net weight measure
type: ObjectProperty
comment: brought back from BSP (UNVTD grounding gap)
domain includes: ProductBatch
range includes: Measure
definition: A measure of the net weight (mass) of this trade product.
term status: proposed