value object
type: Concept
definition: A class that is a bundle of attributes with no independent identity; instances are anonymous nodes inlined in their owner.
in scheme: object-nature
notation: value