occurrence date time
type: DatatypeProperty
comment: added from BSP (per-class property assessment)
domain includes: ProductionProcess
range includes: dateTime
definition: A date, time, date time, or other date time of an occurrence in this supply chain schedule.
term status: proposed