origin country
type: ObjectProperty
comment: code → ISO 3166-1 scheme.
domain includes: Consignment
domain includes: ConsignmentItem
domain includes: Material
range includes: country-id
definition: The country of origin, as an ISO 3166-1 code.
term status: proposed