output applicable batch
type: ObjectProperty
comment: added from BSP (per-class property assessment)
domain includes: ProductionProcess
range includes: ProductBatch
definition: An output batch applicable to this specified production device.
term status: proposed