output applicable material
type: ObjectProperty
comment: added from BSP (per-class property assessment)
domain includes: ProductionProcess
range includes: Material
definition: Output material applicable to this facility production unit.
term status: proposed