dangerous goods packaging level packaging danger level code
type: ObjectProperty
comment: added from BSP (default-keep re-triage)
domain includes: DangerousGoods
range includes: dangerous-goods-packaging-level-code-list
definition: The code specifying the level of danger that the packaging of these dangerous goods must cover for transport purposes.
term status: proposed