partial payment amount
type: ObjectProperty
comment: added from BSP (per-class property assessment)
domain includes: PaymentTerms
range includes: MonetaryAmount
definition: A monetary value of a partial payment in these trade payment terms.
term status: proposed