payee party
type: ObjectProperty
comment: added from BSP (per-class property assessment)
definition: A payee party for this header trade settlement.
domain includes: PaymentTerms
range includes: Party
term status: proposed