payment arrangement code
type: ObjectProperty
comment: code → transport-service-payment-arrangement scheme (re-added from BSP).
domain includes: Consignment
range includes: transport-service-payment-arrangement-code-list
definition: The payment arrangement for this logistics service charge.
term status: proposed