payment means channel payment channel code
type: ObjectProperty
comment: added from BSP (default-keep re-triage)
domain includes: PaymentMeans
range includes: payment-means-channel-code-list
definition: The code specifying the payment channel through which this trade settlement payment is to be processed (Reference United Nations Code List (UNCL) 4435).
term status: proposed