payment id
type: ObjectProperty
comment: added from BSP (per-class property assessment)
domain includes: TradeTax
range includes: Identifier
definition: The unique identifier of the payment of this trade related tax, levy or duty.
term status: proposed