trade payment terms payment means id
type: ObjectProperty
comment: added from BSP (per-class property assessment)
definition: An identifier of a payment means in these trade payment terms.
domain includes: PaymentTerms
range includes: PaymentMeans
term status: proposed