payment means type
type: DatatypeProperty
comment: added from BSP (per-class property assessment)
domain includes: PaymentMeans
range includes: string
definition: The type of trade settlement payment means, expressed as text.
term status: proposed