payment method code
type: ObjectProperty
comment: added from BSP (per-class property assessment)
definition: The code specifying the method by which a payment may be made for this trade settlement payment means.
domain includes: PaymentMeans
range includes: payment-method-code-list
term status: proposed